{"text_format":"1","workbook":"xlsx","n_sheets":8,"sheets":["Einsatz fremde Dünger","Daten","Suisse_Bilanz_1.17","GMF_1.8","Lineare Korrektur","Grafik","Richtwerte Hofdünger","Modul1"],"not_rendered":{"charts":2,"images":0,"macros":1,"external_links":0,"defined_names":82,"comments":4,"pivot_tables":0},"unopened":[{"sheet":"Modul1","index":7,"reason":"part_missing"}],"bounds":{"document_bytes":16777216,"sheet_cells":100000,"rows_first":2000,"rows_last":500,"rows_between":2000,"halvings":0,"cell_chars":16384,"cell_head_chars":4096},"cells_cut":0,"cells_raw":0,"read":"whole","date_system":"1900"}

{"sheet":"Einsatz fremde Dünger","index":0,"n_rows":202,"n_cols":19,"rows_kept":202,"cut":false,"hidden":false,"merged":[[9,12,9,14],[7,8,7,9],[8,8,8,9],[7,12,7,14],[8,12,8,14]]}
["Hinweis: Diese Tabelle weist keine automatischen Bezüge zur Tabelle \"Suisse_Bilanz_…\" auf."]
["Mit dieser Tabelle kann der Saldo-Stand der Nährstoffkontingente für N und P unter dem Jahr nachgeführt werden.",null,null,null,null,null,null,null,null,null,null,null,null,null,null,null,null,null,"Hinweise zur Dateneingabe:"]
["Zuerst den Kopf ausfüllen (gelbe Zellen), sowie die max. möglichen Zufuhren nach aktueller Nährstoffbilanz. ",null,null,null,null,null,null,null,null,null,null,null,null,null,null,null,null,null,"  Hell-Gelbe Zellen: Daten eingeben"]
["Die Einsätze der betriebsfremden Dünger aufführen. Dabei auf korrekte Angaben achten z.B. wenn",null,null,null,null,null,null,null,null,null,null,null,null,null,null,null,null,null,"  grüne Zellen: Daten aus Liste auswählen"]
["die Menge Ammonsalpeter in kg eingegeben wird, den N-Gehalt auch je kg eingeben (also 0.275).",null,null,null,null,null,null,null,null,null,null,null,null,null,null,null,null,null,"  weiss od. andere Farbe: gesperrt, keine Dateneingabe "]
["Zum Ausdrucken die Anzahl Seiten festlegen (Datei - Drucken - Seiten von ... bis ... )."]
[]
[" Einsatz betriebsfremder Düngemittel",null,null,null,null,null,null,"von:",null,null,null,"Betrieb: ",null,null,null,"Nr."]
["   alle betriebsfremden Düngemittel:",null,null,null,null,null,null,"bis: "]
[null,"> betriebsfremde Hofdünger, zugeführtes Stroh zum Streuen, ...",null,null,null,null,null,null,null,null,null,null,null,null,null,null,"Blatt  1"]
{"$rows_left_out":193}
{"sheet":"Daten","index":1,"n_rows":486,"n_cols":31,"rows_kept":486,"cut":false,"hidden":false,"merged":[[0,0,0,3],[352,10,352,11],[309,12,309,13],[242,12,242,13],[353,10,353,11],[288,20,288,21],[2,12,5,12],[323,5,323,11],[288,22,288,23],[288,17,288,19]]}
["Spalten für Listen (Daten > Gültigkeit > Liste)",null,null,null," Datentabelle für Nährstoffhaushalt-Berechnung mit EXCEL-Prg. SB 1.17 (nach Wegleitung Suisse-Bilanz, BLW / agridea)",null,null,null,null,null,null,null,null," Bem./Hinweise","Korrektur N-Düngung (Grudaf Tab. 17)",null,null,null,null,null,null,null,null,"für",{"$f":"Suisse_Bilanz_1.17!K7","v":"ÖLN"},"stop","für BIO-Variante","  Sollte mind. 80% sein, wegen N-Korrektur (wenn mit BIO-Standard-Ertrag gerechnet wird d.h. kein betriebsspez. Ertrag eingegeben wird) "]
[]
["Namen (Einfügen Namen definieren)",null,null,"Bemerkungen","Abkürz.","Kultur","Einheit","Ertrag","N","P2O5","K2O","Mg","Code Betriebs-erhebungs-formular",null,"N-Korrektur-","max.","max. N-",null,"Bemerkungen",null,null,null,null,null,"Standard-",null,"BIO-Standard-"]
[null,null,null,null,null,null,null,"pro ha","kg /ha","kg pro Ertragseinheit oder ha",null,null,null,null,"Faktor ","Ertrag","Zuschlag",null,null,null,null,null,null,null,"ertrag",null,"Ertrag (Kt. TG)"]
["Kulturen_","  ",null,null,"Ackerkulturen, Gründüngung (= offenes Ackerland)",null,null,null,null,null,null,null,null,null,"kg N / dt Körner","dt/ha","kg N/ha",null,null,null,null,null,null,null,"in SB",null,"pro ha","in % REF-Ertrag"]
["Acker",{"$f":"F6","v":" -"},null,null,0," -",null,null,null,null,null,null,null,null,null,null,null,null,null,null,null,null,null,null,null,null,null,{"$f":"IF(AND(ISNUMBER(H6),H6>0),IF(AA6/H6<0.8,\"Bio-Ertrag zu tief\",AA6/H6),\"\")","v":""}]
[null,"Ackerbohnen",null,null,"ab","Ackerbohnen","dt Kö",40,0,1.4,2.13,0.25,536,null,null,null,null,null,null,null,null,null,null,null,{"$f":"IF(Y$1=\"BIO\",AA7,H7)","v":40},null,40,{"$f":"IF(AND(ISNUMBER(H7),H7>0),IF(AA7/H7<0.8,\"Bio-Ertrag zu tief\",AA7/H7),\"\")","v":1}]
[null,"Ackerschonstreifen",null,"neu 1.13","as","Ackerschonstreifen","ha",0,0,40,5,6,null,null,null,null,null,null,"Angabe in kg/ha, nicht an Ertrag anzupassen",null,null,null,null,null,{"$f":"IF(Y$1=\"BIO\",AA8,H8)","v":0},null,0,""]
[null,"CCM-Mais",null,null,"ccm","CCM-Mais","dt Kö",100,110,0.76,0.4,0.09,null,null,null,null,null,null,"mit Norm von Körnermais rechnen, unabhängig vom TS-Gehalt (= Anweisung BLW/Qualinova, 2018)",null,null,null,null,null,100,null,80,0.8]
[null,"Eiweisserbsen",null,null,"ee","Eiweisserbsen","dt Kö",40,0,0.98,1.84,0.13,537,null,null,null,null,null,null,null,null,null,null,null,40,null,50,1.25]
{"$rows_left_out":477}
{"sheet":"Suisse_Bilanz_1.17","index":2,"n_rows":261,"n_cols":86,"rows_kept":261,"cut":false,"hidden":false,"merged":[[39,1,39,2],[40,1,40,2],[41,1,41,2],[168,15,168,16],[86,1,86,4],[96,1,96,4],[113,1,113,4],[122,1,122,4],[114,1,114,4],[123,1,123,4],[46,1,46,2],[110,5,111,5],[63,16,63,17],[120,2,120,4],[135,1,135,4],[129,1,129,4],[47,1,47,2],[85,1,85,4],[83,1,83,4],[93,1,93,4],[121,1,121,2],[95,1,95,4],[92,1,92,4],[84,1,84,4],[37,72,37,73],[42,9,42,11],[43,9,43,11],[208,13,208,15],[207,11,207,12],[48,26,49,40],[160,26,161,36],[157,26,158,35],[165,26,165,29],[165,31,165,35],[169,13,169,14],[245,4,245,5],[210,5,210,6],[209,13,209,15],[207,13,207,15],[209,5,209,6],[210,13,210,15],[210,7,210,9],[209,7,209,9],[209,11,209,12],[210,71,210,75],[210,68,210,70],[210,66,210,67],[207,5,207,6],[207,7,207,9],[181,2,181,4],[89,1,89,4],[180,2,180,4],[178,7,178,8],[127,1,127,4],[134,1,134,4],[28,36,28,43],[184,2,184,4],[208,11,208,12],[210,11,210,12],[26,1,26,4],[45,1,45,2],[44,1,44,2],[182,2,182,4],[208,5,208,6],[183,2,183,4],[208,7,208,9],[42,1,42,2],[43,1,43,2],[121,3,121,4],[112,1,112,4],[88,1,88,4],[27,1,27,4],[24,1,24,4],[25,1,25,4],[23,1,23,4],[8,14,8,17],[14,0,16,0],[14,51,14,53],[1,40,1,46],[2,40,2,46],[6,6,6,7],[7,10,7,11],[7,2,7,7],[3,40,3,46],[7,14,7,15],[6,10,6,11],[8,19,9,24],[15,38,15,44],[1,1,1,17],[8,2,8,7],[10,2,11,17]]}
[null,null,null,null,null,null,null,null,null,null,null,null,null,null,null,null,null,null,null,null,null,null,null,null,null,null,"Die Berechnungen basieren auf der \"Suisse-Bilanz\" von agridea und EVD/BLW (Version 1.17, 2022).",null,null,null,null,null,null,null,null,null,null,"  Aktuelle Wegleitung Suisse-Bilanz verfügbar unter:",null,null,null,null,null,null,null,null,null,null,null,null,"   ",null,null,null,null,null,null,null,null,null,null,null,null,null,null,null,null,null,null,null,null,null,null,null,"    ",null,null,null,null,null,null,null,null,null,null,"stop"]
[null,"       -> immer mit Makros speichern -> Dateityp \"mit Makros\" wählen   -> Excel 2010: Datei / Speichern unter / Excel-Arbeitsmappe mit Makros (*.xlsm)",null,null,null,null,null,null,null,null,null,null,null,null,null,null,null,null,null,null,null,null,null,null,null,null,"Massgebend ist die Wegleitung Suisse-Bilanz von agridea und EVD/BLW, nehmen Sie diese zur Hand!",null,null,null,null,null,null,null,null,null,null,"   - BLW: Instrumente > Direktzahlungen > ökologischer Leistungsnachweis > Düngerbilanz > Rechtliche Grundlagen",null,null,"https://www.blw.admin.ch/blw/de/home/instrumente/direktzahlungen/oekologischer-leistungsnachweis/ausgeglichene-duengerbilanz.html",null,null,null,null,null,null,null,null,null," ",null,null,null,null,null,null,null,"Liste (für Daten Gültigkeit)",null,"Liste (für Daten Gültigkeit)"]
["2022-11-23","          Gültigkeit der Version 1.17:  Jahre 2023 - 2024 (= Info Juni 2022)  -> siehe BLW:",null,null,null,null,null,null,null,"https://www.blw.admin.ch/blw/de/home/instrumente/direktzahlungen/oekologischer-leistungsnachweis/ausgeglichene-duengerbilanz.html",null,null,null,{"$f":"IF((MID(K8,SEARCH(\"20??\",K8),4)*1) > 2024,\"  \"&K8&\": -> neue Version verwenden!\",IF((MID(K8,SEARCH(\"20??\",K8),4)*1) < 2023,\"  \"&K8&\": -> alte Version verwenden!\",\"\"))","v":""},null,null,null,null,null,null,null,null,null,null,null,null,"nachstehend eine Kurz-Anleitung: ",null,null,null,null,null,null,null,null,null,null,"   - agridea: Publikationen > downloads > ökologischer Leistungsnachweis > Suisse-Bilanz",null,null,"http://www.agridea.ch/de/publikationen/publikationen/aufzeichnungen-nachweis/suisse-bilanz",null,null,null,null,null,null,null,null,null,"   ",null,null,null,null,null,null,null,"Vollmist Typ",null,"Vollmist Zu-, Wegfuhr",null,null,null,null,null,null,null,null,null,null,null,null,null,"    "]
[null,null,null,null,null,null,null,null,null,null,null,null,null,null,null,null,null,null,null,null,null,null,null,null,null,null,"- Datei Speichern    - als Arbeitsmappe: Dokument-Name.xlsm (mit Makros) ",null,null,null,null,null,null,null,null,null,null,"   - BBZ Arenenberg: Beratung > Acker- und Futterbau, Düngung > Suisse-Bilanz",null,null,"https://arenenberg.tg.ch/beratung/ackerbau.html/340",null,null,null,null,null,null,null,null,null,"   ",null,null,null,null,null,null,null,null,null,null,null,null,null,null,null,null,null,null,null,null,null,null,null,"    "]
[null,"Suisse-Bilanz  -  Nährstoffhaushalt Gesamtbetrieb",null,null,null,null,null,null,null,null,null,null,null,null,null,null,null,"(Basis = Version 1.17,  2023, agridea und EVD/BLW)",null,null,null,null,null,null,null,null,"                               - als Mustervorlage: z.B. SB1.17_TG_.xltm (mit Makros)",null,null,null,null,null,null,null,null,null,null,null,null,null,null,null,null,null,null,null,null,null,null,null,"   ",null,null,null,null,null,null,null,0,null,"ja",null,null,null,null,null,null,null,null,null,null,null,null,null,"    "]
[null,"  Version 1.17 - 2023 Copyright by Arenenberg, Acker- und Futterbau, 8268 Salenstein",null,null,null,null,null,null,null,null,null,null,null,null,null,null,null,{"$f":"Daten!E451","v":"Auskunft: Daniel Nyfeler 058 345 85 21, Gregor Affolter 058 345 85 18"},null,null,null,null,null,null,null,null,"- Das Arbeitsblatt \"Suisse_Bilanz_1.17\" ist die Berechnungstabelle für die Nährstoffbilanz (sowie Menge und Gehalte der Hofdünger).",null,null,null,null,null,null,null,null,null,null,null,null,null,null,null,null,null,null,null,null,null,null,null,"   ",null,null,null,null,null,null,null,50,null,"nein",null,null,null,null,null,null,null,null,null,null,null,null,null,"    "]
[null,null,null,null,null,"Betr.Nr.",null,null,null,{"$f":"IF(ISBLANK(K7),\"Prod.Art ? -> \",\"\")","v":""},"ÖLN",null,null,null,null,null,null,null,null,null,null,null,null,null,null,null,"- Das Arbeitsblatt \"Lineare Korrektur\" dient der Berechnung des Nährstoffanfalls, sofern NPr-Futter nach Zusatzmodul 6 zu berücksichtigen ist. ",null,null,null,null,null,null,null,null,null,null,null,null,null,null,null,null,null,null,null,null,null,null,null,"   ",null,null,null,null,null,null,null,100,null,null,null,null,null,null,null,null,null,null,null,null,null,null,null,"    "]
[null,"Name: "," ",null,null,null,null,null,null,"Jahr:",2023,null,null," Datum:",{"$f":"TODAY()","v":"2023-02-14"},null,null,"Seite 1",null,null,null,null,null,null,null,null,"- Das Arbeitsblatt \"GMF\" dient der Berechnung der Futterbilanz für die graslandbasierte Milch- und Fleischproduktion, Achtung: zuerst die Suisse-Bilanz vollständig ausfüllen.",null,null,null,null,null,null,null,null,null,null,null,null,null,null,null,null,null,null,null,null,null,null,null,"   ",null,null,null,null,null,null,null,null,null,null,null,null,null,null,null,null,null,null,null,null,null,null,null,"    "]
[null,"Adresse: ",null,null,null,null,null,null,null,"1.1.-31.12.",null,null,null,"erstellt von:",null,null,null,null,null,"Dateneingabe - mit Tabulator-Taste jeweils ins nächste Eingabefeld springen",null,null,null,null,null,null,"- Springen Sie mit der Tabulator-Taste zu den \"freien\" (ungesperrten) Feldern und geben Sie die Daten ein.",null,null,null,null,null,null,null,null,null,null,null,null,null,null,null,null,null,null,null,null,null,null,null,"   ",null,null,null,null,null,null,null,null,null,null,null,null,null,null,null,null,null,null,null,null,null,null,null,"    "]
[null,null,null,null,null,null,null,null,null,null,null,null,null,null,null,null,null,null,null,null,null,null,null,null,null,null,null,null,null,null,null,null,null,null,null,null,null,null,null,null,null,null,null,null,null,null,null,null,null,null,"   ",null,null,null,null,null,null,null,null,null,null,null,null,null,null,null,null,null,null,null,null,null,null,null,"    "]
{"$rows_left_out":252}
{"sheet":"GMF_1.8","index":3,"n_rows":104,"n_cols":29,"rows_kept":104,"cut":false,"hidden":false,"merged":[[6,3,9,3],[0,12,0,13],[41,23,41,24],[4,10,4,11],[36,16,37,16]]}
[null,"Futterbilanz für die graslandbasierte",null,null,null,null,null,null,{"$f":"IF(ISBLANK(Suisse_Bilanz_1.17!G7),\"Betr.-Nr. im Blatt 'Suisse_Bilanz…' erfassen\",Suisse_Bilanz_1.17!G7)","v":"Betr.-Nr. im Blatt 'Suisse_Bilanz…' erfassen"},null,null,null,{"$f":"Suisse_Bilanz_1.17!O8","v":"2023-02-14"},null,null,"  ","Anleitung",null,"   ","Hilfsspalten für Berechnungen",null,null,null,null,null,null,null,null,"   "]
[null,{"$f":"\"Milch- und Fleischproduktion (GMF)  \"&Suisse_Bilanz_1.17!K8","v":"Milch- und Fleischproduktion (GMF)  2023"},null,null,null,null,null,null,{"$f":"IF(ISBLANK(Suisse_Bilanz_1.17!C8),\"Adresse im Blatt 'Suisse_Bilanz…' erfassen\",Suisse_Bilanz_1.17!C8)","v":" "},null,null,null,null,null,null,null,"Hinweis: Die Futterbilanz gilt nur zusammen mit der Nährstoffbilanz des entsprechenden Jahres, ",null,"   ",null,null,null,null,null,null,null,null,null,"   "]
[null,"Version 1.8",null,null,null,null,null,null,{"$f":"IF(ISBLANK(Suisse_Bilanz_1.17!C9),\"\",Suisse_Bilanz_1.17!C9)","v":""},null,null,null,null,null,null,null,"                weil die Futterbilanz mit den Daten der Nährstoffbilanz übereinstimmen muss.",null,"   ",null,null,null,null,null,null,null,null,null,"   "]
[null,{"$f":"\"als Ergänzung zur Suisse-Bilanz \"&Suisse_Bilanz_1.17!K8","v":"als Ergänzung zur Suisse-Bilanz 2023"},null,null,null,null,null,null,null,null,null,null,null,null,null,null," zur Dateneingabe:",null,"   ",null,null,null,null,null,null,null,null,null,"   "]
[null,null,null,null,null,null,null,null,null,{"$f":"IF(OR(LEFT(K5,4)=\"Talg\",LEFT(K5,4)=\"Berg\"),\"Gebietszuteilung: \",\"Wählen Sie die Gebietszuteilung ->  \")","v":"Wählen Sie die Gebietszuteilung ->  "},"   ",null,null,null,null,null,"  grün:  aus Liste wählen",null,"   ",null,null,null,null,null,null,null,null,null,"   "]
[null,"Teil A: Grund- und Kraftfutterverzehr (Bedarf)",null,null,null,null,null,null,null,null,null,null,null,null,null,null,"  gelb:   Daten eingeben",null,"   ",null,null,null,null,null,null,null,null,null,"   "]
[null,null,null,"Raufutterverzehrer",null,"Grund-",{"$f":"IF(U22>0,\"davon\",\"\")","v":""},"Kraftfutter-",null,"Sömmerung",null,null,null,null,null,null,"  weiss (oder weitere Farbe):  Zelle gesperrt bzw. keine Dateneingabe",null,"   ",null,null,null,null,null,"Faktor","Raufutterverzehrer",null,null,"   "]
[null,{"$f":"Suisse_Bilanz_1.17!B15","v":" Tierkategorien"},null,null,"Anzahl","futter-",{"$f":"IF(U22>0,\"Wiesen-  &\",\"\")","v":""},"verzehr",null,null,null,null,null,null,null,null,null,null,"   ",null,"Typ für","GF-Verzehr","Sö-KF","Sö-GF-Korr.","RGVE","RGVE",null,null,"   "]
[null,"  gemäss Suisse-Bilanz",{"$f":"IF(OR(ISNUMBER(E11),ISNUMBER(E12)),\"Milchproduktion\",\"\")","v":""},null,"gemäss","verzehr",{"$f":"IF(U22>0,\"Weidefutter\",\"\")","v":""},"kg FS","dt FS","Anzahl",{"$f":"IF(SUMIF(J11:J19,\">0\")>0,\"Anzahl\",\"\")","v":""},{"$f":"IF(SUMIF(J11:J19,\">0\")>0,\"Sömmerungs-\",\"\")","v":""},{"$f":"IF(SUMIF(J11:J19,\">0\")>0,\"GF-Verzehr\",\"\")","v":""},{"$f":"IF(SUMIF(J11:J19,\">0\")>0,\"Kraftfutter\",\"\")","v":""},{"$f":"IF(COUNT(O11:O19)>0,\"KF-Sömmerung\",\"\")","v":""},"  ","Vorgehen:",null,"   ",null,"Summen-","pro Einheit","kg KF/Einheit","nach KF",null,"Betrieb","Sömmerung","Summe","   "]
[null,null,{"$f":"IF(OR(ISNUMBER(E11),ISNUMBER(E12)),\"kg/Kuh/Jahr\",\"\")","v":""},null,"Suisse-Bil.",{"$f":"Suisse_Bilanz_1.17!K16","v":"dt TS/J."},{"$f":"IF(U22>0,F10,\"\")","v":""},"pro Einh.","total","Tiere",{"$f":"IF(SUMIF(J11:J19,\">0\")>0,\"Tage\",\"\")","v":""},{"$f":"IF(SUMIF(J11:J19,\">0\")>0,\"Tage total\",\"\")","v":""},{"$f":"IF(SUMIF(J11:J19,\">0\")>0,\"dt TS total\",\"\")","v":""},{"$f":"IF(SUMIF(J11:J19,\">0\")>0,\"dt FS total\",\"\")","v":""},{"$f":"IF(COUNT(O11:O19)>0,\"kg KF/Tier-Einheit/Tag\",\"\")","v":""},null,"1. zuerst Suisse-Bilanz ... ausfüllen,  ",null,"   ",null,"bildung","dt TS / Jahr","umger. im Jahr",null,null,null,null,null,"   "]
{"$rows_left_out":95}
{"sheet":"Lineare Korrektur","index":4,"n_rows":60,"n_cols":31,"rows_kept":60,"cut":false,"hidden":false,"merged":[[1,15,1,16],[5,5,5,8],[4,17,4,20],[5,10,5,12],[4,13,4,14],[5,15,5,16],[37,6,37,7],[34,8,34,9],[35,8,35,9],[6,17,6,18],[33,6,33,7],[34,6,34,7],[35,6,35,7],[36,6,36,7],[6,19,6,20],[5,13,5,14],[6,13,6,14],[42,10,42,12],[42,8,42,9],[33,10,33,12],[36,8,36,9],[37,8,37,9]]}
[null,null,{"$f":"\"Suisse-Bilanz \"&Suisse_Bilanz_1.17!K8","v":"Suisse-Bilanz 2023"},null,null,null,null,null,{"$f":"Suisse_Bilanz_1.17!C8&IF(Suisse_Bilanz_1.17!I8<>0,\"      Nr. \"&Suisse_Bilanz_1.17!I8,\"\")","v":" "}]
[null,null,"Lineare Korrektur nach Futtergehalten (LK)",null,null,null,null,null,{"$f":"Suisse_Bilanz_1.17!C9","v":0},null,null,null,null,null,null,{"$f":"Suisse_Bilanz_1.17!O8","v":"2023-02-14"},null,null,null,null,null,null,null,null,null,null,null,null,null,null,"Bundesamt für Landwirtschaft"]
[null,"                           Berechnung nach Modul 6 (Auflage 1.3, April 2010)","Berechnung nach Zusatzmodul 6 (Auflage 1.12, Weisungen zur Berücksichtigung von nährstoffreduziertem Futter in der Suisse-Bilanz)"]
[]
[null,null,null,null,null,null,null,null,null,null,null,null,null,"Änderung Anfall",null,null,null,"Tiefstwerte"]
[null,null,null,null,null,"Nährstoffanfall",null,null,null,null,"Futtergehalte",null,null," - pro g Gehalt",null,"Vgl. Futter",null,null,null,null,null,null,null,null,null,null,null,null,null,null,"agriidea"]
[null,null,"Tiere: Grundfutterbedarf und Nährstoffanfall","Einheit","GF-Verz.","Nges","P2O5","K2O","Mg",null,"MJ","RP","P","- im Vgl. zu Standard",null,"RP","P","kg / Jahr / Einheit",null," im Vgl. zur Norm"]
[null," Abkürz.","  Tierkategorie",null,"dt TS/Jahr","kg pro Jahr",null,null,null,null,"MJ/kg","g/kg","g/kg","N","P2O5","g/kg","g/kg","Nges","P2O5","Nges","P2O5"]
[]
["Standard",{"$f":"IF(ISBLANK(C10),\"\",VLOOKUP(C10,Daten!$B$291:$E$306,4,FALSE))","v":""},null,{"$f":"IF(ISBLANK(C10),\"\",VLOOKUP(B10,Daten!$E$248:$L$345,3,FALSE))","v":""},{"$f":"IF(ISBLANK(C10),\"\",VLOOKUP(B10,Daten!$E$248:$L$345,4,FALSE))","v":""},{"$f":"IF(ISBLANK(C10),\"\",VLOOKUP(B10,Daten!$E$248:$L$345,5,FALSE))","v":""},{"$f":"IF(ISBLANK(C10),\"\",VLOOKUP(B10,Daten!$E$248:$L$345,6,FALSE))","v":""},{"$f":"IF(ISBLANK(C10),\"\",VLOOKUP(B10,Daten!$E$248:$L$345,7,FALSE))","v":""},{"$f":"IF(ISBLANK(C10),\"\",VLOOKUP(B10,Daten!$E$248:$L$345,8,FALSE))","v":""},null,{"$f":"IF(ISBLANK(C10),\"\",VLOOKUP(B10,Daten!$E$248:$X$345,14,FALSE))","v":""},{"$f":"IF(ISBLANK(C10),\"\",VLOOKUP(B10,Daten!$E$248:$X$345,15,FALSE))","v":""},{"$f":"IF(ISBLANK(C10),\"\",VLOOKUP(B10,Daten!$E$248:$X$345,16,FALSE))","v":""},{"$f":"IF(ISBLANK(C10),\"\",VLOOKUP(B10,Daten!$E$248:$X$345,17,FALSE))","v":""},{"$f":"IF(ISBLANK(C10),\"\",VLOOKUP(B10,Daten!$E$248:$X$345,18,FALSE))","v":""},null,null,{"$f":"IF(ISBLANK(C10),\"\",VLOOKUP(B10,Daten!$E$248:$X$345,19,FALSE))","v":""},{"$f":"IF(ISBLANK(C10),\"\",VLOOKUP(B10,Daten!$E$248:$X$345,20,FALSE))","v":""},{"$f":"(R10/F10)-1","v":{"$error":"#VALUE!"}},{"$f":"(S10/G10)-1","v":{"$error":"#VALUE!"}}]
{"$rows_left_out":51}
{"sheet":"Grafik","index":5,"n_rows":51,"n_cols":24,"rows_kept":51,"cut":false,"hidden":false,"merged":[[26,9,26,10],[26,13,26,14],[1,9,1,10],[1,13,1,14],[2,9,2,10],[2,13,2,14],[25,9,25,10],[25,13,25,14]]}
[null,null,null,null,null,"Übersicht Suisse-Bilanz",null,null,null,null,null,null,null,null,null,null,null,null,{"$f":"\"Grafik zur Suisse-Bilanz \"&Suisse_Bilanz_1.17!K8","v":"Grafik zur Suisse-Bilanz 2023"},null,null,{"$f":"Suisse_Bilanz_1.17!C8","v":" "},{"$f":"Suisse_Bilanz_1.17!G7","v":0},{"$f":"Suisse_Bilanz_1.17!O8","v":"2023-02-14"}]
[null,null,null,null,null,null,null,null,null,"Stickstoff",null,null,null,"% Anteile"]
["Werte aus Berechnung \"Suisse_Bilanz_...\"",null,null,null,null,null,null,null,null,"Nverf, kg/Jahr",null,null,null,"Bedarf = 100%"]
[null,"Nverf (kg)","P2O5 (kg)",null,null,null,null,null,null,"Bedarf","gedüngt",null,null,{"$f":"J4","v":"Bedarf"},{"$f":"K4","v":"gedüngt"},null,"Beschriftung"]
["C1",{"$f":"Suisse_Bilanz_1.17!M72","v":0},{"$f":"Suisse_Bilanz_1.17!N72","v":0},null,null,"Bedarf Grundfutterfläche",null,null,"C1",{"$f":"B5","v":0},null,null,null,{"$f":"IF($J$13>0,J5/J$12,0)","v":{"$error":"#VALUE!"}},null,null,{"$f":"IF(J5>0,$I5&\" = \"&ROUND(J5,0)& \" kg\",\"\")","v":""}]
["C2+C3",{"$f":"Suisse_Bilanz_1.17!M101","v":0},{"$f":"Suisse_Bilanz_1.17!N101","v":0},null,null,"Bedarf Acker- und Spezialkulturen",null,null,"C2+C3",{"$f":"B6","v":0},null,null,null,{"$f":"IF($J$13>0,J6/J$12,0)","v":{"$error":"#VALUE!"}},null,null,{"$f":"IF(J6>0, $I6&\" = \"&ROUND(J6,0)& \" kg\",\"\")","v":""}]
["A2",{"$f":"Suisse_Bilanz_1.17!J150","v":0},{"$f":"Suisse_Bilanz_1.17!K150","v":0},null,null,"aus Tierhaltung",null,null,"von A2",null,{"$f":"B19+B24","v":0},"1)           ",null,null,{"$f":"IF(AND(J12<>0,K7<>\"\"),K7/$J$12,\"\")","v":""},null,{"$f":"IF(AND(ISNUMBER(K7),K7>0),$I7&\" = \"&ROUND(K7,0)& \" kg\",\"\")","v":""}]
["Saldo A3",{"$f":"Suisse_Bilanz_1.17!N116","v":0},{"$f":"Suisse_Bilanz_1.17!O116","v":0},null,null,"Zu- und Wegfuhr Hofdünger",null,null,"A3",null,{"$f":"IF(B8>=0,B8,\"\")","v":0},null,null,null,{"$f":"IF(AND(J12<>0,K8<>\"\"),K8/$J$12,\"\")","v":""},null,{"$f":"IF(AND(ISNUMBER(K8),K8>0),$I8&\" = \"&ROUND(K8,0)& \" kg\",\"\")","v":""}]
["Saldo E",{"$f":"Suisse_Bilanz_1.17!N140","v":0},{"$f":"Suisse_Bilanz_1.17!O140","v":0},null,null,"Vergärungsprodukte",null,null,"E",null,{"$f":"IF(B9>=0,B9,\"\")","v":0},null,null,null,{"$f":"IF(AND(J12<>0,K9<>\"\"),K9/$J$12,\"\")","v":""},null,{"$f":"IF(AND(ISNUMBER(K9),K9>0),I9&\" = \"&ROUND(K9,0)& \" kg\",\"\")","v":""}]
["Saldo D",{"$f":"Suisse_Bilanz_1.17!N125","v":0},{"$f":"Suisse_Bilanz_1.17!O125","v":0},null,null,"übrige Dünger",null,null,"D",null,{"$f":"IF(B10>=0,B10,\"\")","v":0},null,null,null,{"$f":"IF(AND(J12<>0,K10<>\"\"),K10/$J$12,\"\")","v":""},null,{"$f":"IF(AND(ISNUMBER(K10),K10>0),I10&\" = \"&ROUND(K10,0)& \" kg\",\"\")","v":""}]
{"$rows_left_out":42}
{"sheet":"Richtwerte Hofdünger","index":6,"n_rows":81,"n_cols":33,"rows_kept":81,"cut":false,"hidden":false,"merged":[[3,6,3,10],[62,8,62,10]]}
[null,"Richtwerte für den Gehalt von Hofdüngern",null,null,null,null,null,null,null,null,null,null,null,null,"Quelle: GRUD 2017"]
[null,"-> Mit Tab. \"Suisse_Bilanz_...\" (Seite 3) können betriebsspezifische Durchschnitts-Gehalte berechnet werden!"]
[]
[null,null,null,null,null,null,"Stickstoff",null,null,null,null,"Phosphat","Kali","Magnesium","Calcium"]
[null,null,"Ver-",null,"TS","OS","Ntot","Nlös","Nverf",null,null,"P2O5","K2O","Mg","Ca","Nährstoffverhältnisse",null,null,null,null,null,"%TS","OS","Ntot","Nlös","Nverf",null,null,"P2O5","K2O","Mg","Ca","Bemerkungen"]
[null,null,null,"dünnung","kg / m3 Gülle  bzw.  kg / t Mist",null,null,null,null,null,null,null,null,null,null,"Ntot","Nverf","P2O5","K2O","Mg",null,null,"%TS","kg / t TS"]
[null,"Milchvieh"]
[null,"Vollgülle","1:",0,90,70,3.9,2.1,2.2000000000000002,"-",2.7,1.7,7.5,0.61,1.5,{"$f":"G8/$L8","v":2.2941176470588234},{"$f":"(I8+K8)/2/L8","v":1.4411764705882355},{"$f":"L8/$L8","v":1},{"$f":"M8/$L8","v":4.4117647058823533},{"$f":"N8/$L8","v":0.35882352941176471},null,{"$f":"IF(E8>0,E8/1000,\"\")","v":0.09},{"$f":"IF(F8>0,F8/E8,\"\")","v":0.77777777777777779},{"$f":"IF(G8>0,G8*1000/$E8,\"\")","v":43.333333333333336},{"$f":"IF(H8>0,H8*1000/$E8,\"\")","v":23.333333333333332},{"$f":"IF(I8>0,I8*1000/$E8,\"\")","v":24.444444444444443},{"$f":"IF(AB8=\"\",\"\",\"-\")","v":"-"},{"$f":"IF(K8>0,K8*1000/$E8,\"\")","v":30},{"$f":"IF(L8>0,L8*1000/$E8,\"\")","v":18.888888888888889},{"$f":"IF(M8>0,M8*1000/$E8,\"\")","v":83.333333333333329},{"$f":"IF(N8>0,N8*1000/$E8,\"\")","v":6.7777777777777777},{"$f":"IF(O8>0,O8*1000/$E8,\"\")","v":16.666666666666668},"GRUD 2017, Modul 4/ Eigenschaften und Anwendung von Düngern, Tab. 6"]
[null,null,"1:",1,{"$f":"E$8/(1+$D9)","v":45},{"$f":"F$8/(1+$D9)","v":35},1.95,1.05,1.1000000000000001,"-",1.35,0.85,3.75,0.30499999999999999,0.75,null,null,null,null,null,null,4.4999999999999998E-2]
[null,null,"1:",1.5,{"$f":"E$8/(1+$D10)","v":36},28,1.56,0.84000000000000008,0.88000000000000012,"-",1.08,0.67999999999999994,3,0.24399999999999999,0.6,null,null,null,null,null,null,3.5999999999999997E-2]
{"$rows_left_out":71}